Reaction Details
TargetCannabinoid receptor 1
LigandBDBM50341032
Substrate/Competitorn/a
Meas. Tech.ChEMBL_740155 (CHEMBL1763215)
EC50>20000±n/a nM
Citation Riether, DWu, LCirillo, PFBerry, AWalker, ERErmann, MNoya-Marino, BJenkins, JEAlbaugh, DAlbrecht, CFisher, MGemkow, MJGrbic, HLöbbe, SMöller, CO'Shea, KSauer, AShih, DTThomson, DS 1,4-Diazepane compounds as potent and selective CB2 agonists: optimization of metabolic stability. Bioorg Med Chem Lett21:2011-6 (2011) 
 
Cannabinoid receptor 1
Name:Cannabinoid receptor 1
Type:G Protein-Coupled Receptor (GPCR)
Mol. Mass.:52868.96
Organism:Homo sapiens (Human)
Description:P21554
Residue:472
BDBM50341032
NameBDBM50341032
Synonyms:4-(3-cyclopentylpropanoyl)-N-(4-isopropylphenyl)-1,4-diazepane-1-carboxamide | CHEMBL1762281
TypeSmall organic molecule
Emp. Form.C23H35N3O2
Mol. Mass.385.5429
SMILESCC(C)c1ccc(NC(=O)N2CCCN(CC2)C(=O)CCC2CCCC2)cc1