Reaction Details
TargetCannabinoid receptor 1
LigandBDBM50341130
Substrate/Competitorn/a
Meas. Tech.ChEMBL_740279 (CHEMBL1764225)
IC50 41±n/a nM
Citation Kitajima, MIwai, MKikura-Hanajiri, RGoda, YIida, MYabushita, HTakayama, H Discovery of indole alkaloids with cannabinoid CB1 receptor antagonistic activity. Bioorg Med Chem Lett21:1962-4 (2011) 
 
Cannabinoid receptor 1
Name:Cannabinoid receptor 1
Type:G Protein-Coupled Receptor (GPCR)
Mol. Mass.:52868.96
Organism:Homo sapiens (Human)
Description:P21554
Residue:472
BDBM50341130
NameBDBM50341130
Synonyms:CHEMBL445022 | voacamine
TypeSmall organic molecule
Emp. Form.C44H56N4O5
Mol. Mass.720.9392
SMILESCC[C@H]1C[C@@H]2CN3CCC4C(Nc5cc([C@H]6C[C@H]7C(C\C7=C\C)[C@@H](C(Cc7c6[nH]c6ccccc76)NC)C(=O)OC)c(OC)cc45)[C@](C2)([C@H]13)C(=O)OC