Reaction Details
TargetPolyphenol oxidase 2
LigandBDBM50341135
Substrate/Competitorn/a
Meas. Tech.ChEMBL_740346 (CHEMBL1764347)
IC50 8800±n/a nM
Citation Takahashi, TMiyazawa, M Synthesis and structure-activity relationships of phenylpropanoid amides of serotonin on tyrosinase inhibition. Bioorg Med Chem Lett21:1983-6 (2011) 
 
Polyphenol oxidase 2
Name:Polyphenol oxidase 2
Type:Protein
Mol. Mass.:63923.66
Organism:Agaricus bisporus (Common mushroom)
Description:O42713
Residue:556
BDBM50341135
NameBDBM50341135
Synonyms:CHEMBL1760547 | N-p-Coumaroyl serotonin
TypeSmall organic molecule
Emp. Form.C19H18N2O3
Mol. Mass.322.3578
SMILESOc1ccc(\C=C\C(=O)NCCc2c[nH]c3ccc(O)cc23)cc1