Reaction Details
TargetPolyphenol oxidase 2
LigandBDBM50341137
Substrate/Competitorn/a
Meas. Tech.ChEMBL_740346 (CHEMBL1764347)
IC50 5400±n/a nM
Citation Takahashi, TMiyazawa, M Synthesis and structure-activity relationships of phenylpropanoid amides of serotonin on tyrosinase inhibition. Bioorg Med Chem Lett21:1983-6 (2011) 
 
Polyphenol oxidase 2
Name:Polyphenol oxidase 2
Type:Protein
Mol. Mass.:63923.66
Organism:Agaricus bisporus (Common mushroom)
Description:O42713
Residue:556
BDBM50341137
NameBDBM50341137
Synonyms:CHEMBL1760549 | N-Isoferuloyl serotonin
TypeSmall organic molecule
Emp. Form.C20H20N2O4
Mol. Mass.352.3838
SMILESCOc1ccc(\C=C\C(=O)NCCc2c[nH]c3ccc(O)cc23)cc1O