Reaction Details
TargetPolyphenol oxidase 2
LigandBDBM50241245
Substrate/Competitorn/a
Meas. Tech.ChEMBL_740346 (CHEMBL1764347)
IC50 115200±n/a nM
Citation Takahashi, TMiyazawa, M Synthesis and structure-activity relationships of phenylpropanoid amides of serotonin on tyrosinase inhibition. Bioorg Med Chem Lett21:1983-6 (2011) 
 
Polyphenol oxidase 2
Name:Polyphenol oxidase 2
Type:Protein
Mol. Mass.:63923.66
Organism:Agaricus bisporus (Common mushroom)
Description:O42713
Residue:556
BDBM50241245
NameBDBM50241245
Synonyms:(2E)-3-(3-hydroxy-4-methoxyphenyl)prop-2-enoic acid CHEMBL233295 isoferulic acid
TypeSmall organic molecule
Emp. Form.C10H10O4
Mol. Mass.194.184
SMILESCOc1ccc(\C=C\C(O)=O)cc1O