Reaction Details
TargetPeroxisome proliferator-activated receptor gamma
LigandBDBM50049240
Substrate/Competitorn/a
Meas. Tech.ChEMBL_740347 (CHEMBL1764348)
EC50 390±n/a nM
Citation Ushiroda, KMaruta, KTakazawa, TNagano, TTaiji, MKohno, TSato, YHorai, SYanagi, KNagata, R Synthesis and pharmacological evaluation of novel benzoylazole-based PPARa/κ activators. Bioorg Med Chem Lett21:1978-82 (2011) 
 
Peroxisome proliferator-activated receptor gamma
Name:Peroxisome proliferator-activated receptor gamma
Type:Nuclear Receptor
Mol. Mass.:57613.46
Organism:Homo sapiens (Human)
Description:P37231
Residue:505
BDBM50049240
NameBDBM50049240
Synonyms:(+-)-5-((4-(2-(5-ethyl-2-pyridinyl)ethoxy)phenyl)methyl)-2,4-thiazolidinedione CHEMBL595 PIOGLITAZONE HYDROCHLORIDE
TypeSmall organic molecule
Emp. Form.C19H20N2O3S
Mol. Mass.356.439
SMILESCCc1ccc(CCOc2ccc(Cc3sc(=O)[nH]c3O)cc2)nc1