Reaction Details
TargetAmine oxidase [flavin-containing] B
LigandBDBM50341161
Substrate/Competitorn/a
Meas. Tech.ChEMBL_740468 (CHEMBL1764623)
Ki 1.7±n/a nM
Citation Mishra, NSasmal, D Development of selective and reversible pyrazoline based MAO-B inhibitors: virtual screening, synthesis and biological evaluation. Bioorg Med Chem Lett21:1969-73 (2011) 
 
Amine oxidase [flavin-containing] B
Name:Amine oxidase [flavin-containing] B
Type:Protein
Mol. Mass.:58768.76
Organism:Homo sapiens (Human)
Description:P27338
Residue:520
BDBM50341161
NameBDBM50341161
Synonyms:3-(anthracen-9-yl)-5-(4-methoxyphenyl)-4,5-dihydro-1H-pyrazole | CHEMBL1760722
TypeSmall organic molecule
Emp. Form.C24H20N2O
Mol. Mass.352.4284
SMILESCOc1ccc(cc1)C1CC(N=N1)c1c2ccccc2cc2ccccc12