Reaction Details
TargetAdenosine receptor A1
LigandBDBM50341190
Substrate/Competitorn/a
Meas. Tech.ChEMBL_740587 (CHEMBL1764850)
Ki 7±n/a nM
Citation Firooznia, FCheung, AWBrinkman, JGrimsby, JGubler, MLHamid, RMarcopulos, NRamsey, GTan, JWen, YSarabu, R Discovery of benzothiazole-based adenosine A2B receptor antagonists with improved A2A selectivity. Bioorg Med Chem Lett21:1933-6 (2011) 
 
Adenosine receptor A1
Name:Adenosine receptor A1
Type:G Protein-Coupled Receptor (GPCR)
Mol. Mass.:36520.92
Organism:Homo sapiens (Human)
Description:P30542
Residue:326
BDBM50341190
NameBDBM50341190
Synonyms:CHEMBL1760895 | trans-N-(4-(7-(N-ethylacetamido)-4-methoxybenzo[d]thiazol-2-ylcarbamoyl)cyclohexyl)-3-(trifluoromethyl)benzamide
TypeSmall organic molecule
Emp. Form.C27H29F3N4O4S
Mol. Mass.562.604
SMILESCCN(C(C)=O)c1ccc(OC)c2nc(NC(=O)[C@H]3CC[C@@H](CC3)NC(=O)c3cccc(c3)C(F)(F)F)sc12