Reaction Details
TargetAdenosine receptor A2b
LigandBDBM50321518
Substrate/Competitorn/a
Meas. Tech.ChEMBL_740589 (CHEMBL1764852)
Ki 8±n/a nM
Citation Firooznia, FCheung, AWBrinkman, JGrimsby, JGubler, MLHamid, RMarcopulos, NRamsey, GTan, JWen, YSarabu, R Discovery of benzothiazole-based adenosine A2B receptor antagonists with improved A2A selectivity. Bioorg Med Chem Lett21:1933-6 (2011) 
 
Adenosine receptor A2b
Name:Adenosine receptor A2b
Type:G Protein-Coupled Receptor (GPCR)
Mol. Mass.:36341.22
Organism:Homo sapiens (Human)
Description:n/a
Residue:332
BDBM50321518
NameBDBM50321518
Synonyms:CHEMBL1170367 | N-(7-(N-ethylacetamido)-4-methoxybenzo[d]thiazol-2-yl)-1-methyl-1H-pyrazole-5-carboxamide
TypeSmall organic molecule
Emp. Form.C17H19N5O3S
Mol. Mass.373.429
SMILESCCN(C(C)=O)c1ccc(OC)c2nc(NC(=O)c3ccnn3C)sc12