Reaction Details
TargetAdenosine receptor A1
LigandBDBM50341193
Substrate/Competitorn/a
Meas. Tech.ChEMBL_740587 (CHEMBL1764850)
Ki 10±n/a nM
Citation Firooznia, FCheung, AWBrinkman, JGrimsby, JGubler, MLHamid, RMarcopulos, NRamsey, GTan, JWen, YSarabu, R Discovery of benzothiazole-based adenosine A2B receptor antagonists with improved A2A selectivity. Bioorg Med Chem Lett21:1933-6 (2011) 
 
Adenosine receptor A1
Name:Adenosine receptor A1
Type:G Protein-Coupled Receptor (GPCR)
Mol. Mass.:36520.92
Organism:Homo sapiens (Human)
Description:P30542
Residue:326
BDBM50341193
NameBDBM50341193
Synonyms:CHEMBL1760894 | N-(7-(N-ethylacetamido)-4-methoxybenzo[d]thiazol-2-yl)-1-(3-(trifluoromethyl)benzyl)piperidine-4-carboxamide
TypeSmall organic molecule
Emp. Form.C26H29F3N4O3S
Mol. Mass.534.594
SMILESCCN(C(C)=O)c1ccc(OC)c2nc(NC(=O)C3CCN(Cc4cccc(c4)C(F)(F)F)CC3)sc12