Reaction Details
TargetAlpha-glucosidase MAL62
LigandBDBM50341204
Substrate/Competitorn/a
Meas. Tech.ChEMBL_742391 (CHEMBL1768949)
Ki 4860000±n/a nM
Citation Brindis, FRodríguez, RBye, RGonzález-Andrade, MMata, R (Z)-3-butylidenephthalide from Ligusticum porteri , ana-glucosidase inhibitor. J Nat Prod74:314-20 (2011) 
 
Alpha-glucosidase MAL62
Name:Alpha-glucosidase MAL62
Type:PROTEIN
Mol. Mass.:68174.43
Organism:Saccharomyces cerevisiae
Description:ChEMBL_942538
Residue:584
BDBM50341204
NameBDBM50341204
Synonyms:(Z)-3-butylidenephthalide | CHEMBL1765390
TypeSmall organic molecule
Emp. Form.C12H12O2
Mol. Mass.188.2225
SMILESCCC\C=C1\OC(=O)c2ccccc12