Reaction Details
TargetSodium-dependent serotonin transporter
LigandBDBM50322511
Substrate/Competitorn/a
Meas. Tech.ChEMBL_741841 (CHEMBL1768262)
IC50 540±n/a nM
Citation Carroll, FIMuresan, AZBlough, BENavarro, HAMascarella, SWEaton, JBHuang, XDamaj, MILukas, RJ Synthesis of 2-(substituted phenyl)-3,5,5-trimethylmorpholine analogues and their effects on monoamine uptake, nicotinic acetylcholine receptor function, and behavioral effects of nicotine. J Med Chem54:1441-8 (2011) 
 
Sodium-dependent serotonin transporter
Name:Sodium-dependent serotonin transporter
Type:Multi-pass membrane protein
Mol. Mass.:70322.51
Organism:Homo sapiens (Human)
Description:P31645
Residue:630
BDBM50322511
NameBDBM50322511
Synonyms:(2S,3S)-2-(3-Chlorophenyl)-3,4,5,5-tetramethylmorpholin-2-ol | CHEMBL1171260
TypeSmall organic molecule
Emp. Form.C14H20ClNO2
Mol. Mass.269.767
SMILESC[C@@H]1N(C)C(C)(C)CO[C@@]1(O)c1cccc(Cl)c1