Reaction Details
TargetNeuronal acetylcholine receptor subunit alpha-4/beta-2
LigandBDBM50322532
Substrate/Competitorn/a
Meas. Tech.ChEMBL_741842 (CHEMBL1768263)
IC50 20000±n/a nM
Citation Carroll, FIMuresan, AZBlough, BENavarro, HAMascarella, SWEaton, JBHuang, XDamaj, MILukas, RJ Synthesis of 2-(substituted phenyl)-3,5,5-trimethylmorpholine analogues and their effects on monoamine uptake, nicotinic acetylcholine receptor function, and behavioral effects of nicotine. J Med Chem54:1441-8 (2011) 
 
Neuronal acetylcholine receptor subunit alpha-4/beta-2
Name:Neuronal acetylcholine receptor subunit alpha-4/beta-2
Type:Protein
Mol. Mass.:n/a
Description:n/a
Components:This complex has 2 components.
Component 1
Name:Neuronal acetylcholine receptor subunit alpha-4
Synonyms:ACHA4_HUMAN CHRNA4 protein Neuronal acetylcholine receptor protein alpha-4 subunit Nicotinic acetylcholine receptor alpha4/beta2/alpha5
Type:n/a
Mol. Mass.:69963.49
Organism:Homo sapiens (Human)
Description:NACHRA4
Residue:627
Component 2
Name:Neuronal acetylcholine receptor subunit beta-2
Synonyms:ACHB2_HUMAN Neuronal acetylcholine receptor protein beta-2 subunit | Nicotinic acetylcholine receptor alpha3/beta2/alpha5
Type:Protein
Mol. Mass.:57020.50
Organism:Homo sapiens (Human)
Description:P17787
Residue:502
BDBM50322532
NameBDBM50322532
Synonyms:(2S,3S)-2-(3-Chlorophenyl)-3,5,5-trimethylmorpholin-2-ol | CHEMBL1172928
TypeSmall organic molecule
Emp. Form.C13H18ClNO2
Mol. Mass.255.741
SMILESC[C@@H]1NC(C)(C)CO[C@@]1(O)c1cccc(Cl)c1