Reaction Details
TargetPhosphatidylinositol 4-kinase beta
LigandBDBM50341209
Substrate/Competitorn/a
Meas. Tech.ChEMBL_741907 (CHEMBL1768559)
IC50 18±n/a nM
Citation Liu, QWang, JKang, SAThoreen, CCHur, WAhmed, TSabatini, DMGray, NS Discovery of 9-(6-aminopyridin-3-yl)-1-(3-(trifluoromethyl)phenyl)benzo[h][1,6]naphthyridin-2(1H)-one (Torin2) as a potent, selective, and orally available mammalian target of rapamycin (mTOR) inhibitor for treatment of cancer. J Med Chem54:1473-80 (2011) 
 
Phosphatidylinositol 4-kinase beta
Name:Phosphatidylinositol 4-kinase beta
Type:Protein
Mol. Mass.:91373.30
Organism:Homo sapiens (Human)
Description:n/a
Residue:816
BDBM50341209
NameBDBM50341209
Synonyms:9-(6-aminopyridin-3-yl)-1-(3-(trifluoromethyl)phenyl)benzo[h][1,6]naphthyridin-2(1H)-one | CHEMBL1765602
TypeSmall organic molecule
Emp. Form.C24H15F3N4O
Mol. Mass.432.3973
SMILESNc1ccc(cn1)-c1ccc2ncc3ccc(=O)n(-c4cccc(c4)C(F)(F)F)c3c2c1