Reaction Details
Target3-phosphoinositide-dependent protein kinase 1
LigandBDBM50341248
Substrate/Competitorn/a
Meas. Tech.ChEMBL_742334 (CHEMBL1768783)
IC50 74±n/a nM
Citation Medina, JRBecker, CJBlackledge, CWDuquenne, CFeng, YGrant, SWHeerding, DLi, WHMiller, WHRomeril, SPScherzer, DShu, ABobko, MAChadderton, ARDumble, MGardiner, CMGilbert, SLiu, QRabindran, SKSudakin, VXiang, HBrady, PGCampobasso, NWard, PAxten, JM Structure-based design of potent and selective 3-phosphoinositide-dependent kinase-1 (PDK1) inhibitors. J Med Chem54:1871-95 (2011) 
 
3-phosphoinositide-dependent protein kinase 1
Name:3-phosphoinositide-dependent protein kinase 1
Type:Enzyme
Mol. Mass.:63157.65
Organism:Homo sapiens (Human)
Description:O15530
Residue:556
BDBM50341248
NameBDBM50341248
Synonyms:1,1-Dimethylethyl{(3R,5R)-1-[2-amino-6-(3-amino-1H-indazol-6-yl)-4-pyrimidinyl]-5-methyl-3-piperidinyl}carbamate tert-butyl {(3R,5R)-1-[2-amino-6-(3-amino-2H-indazol-6-yl)pyrimidin-4-yl]-5-methylpiperidin-3-yl}carbamate
TypeSmall organic molecule
Emp. Form.C22H30N8O2
Mol. Mass.438.526
SMILESC[C@@H]1C[C@H](CN(C1)c1cc(nc(N)n1)-c1ccc2c(N)[nH]nc2c1)NC(=O)OC(C)(C)C