Reaction Details
TargetAurora kinase B
LigandBDBM50418251
Substrate/Competitorn/a
Meas. Tech.ChEMBL_742331 (CHEMBL1768780)
IC50 158±n/a nM
Citation Medina, JRBecker, CJBlackledge, CWDuquenne, CFeng, YGrant, SWHeerding, DLi, WHMiller, WHRomeril, SPScherzer, DShu, ABobko, MAChadderton, ARDumble, MGardiner, CMGilbert, SLiu, QRabindran, SKSudakin, VXiang, HBrady, PGCampobasso, NWard, PAxten, JM Structure-based design of potent and selective 3-phosphoinositide-dependent kinase-1 (PDK1) inhibitors. J Med Chem54:1871-95 (2011) 
 
Aurora kinase B
Name:Aurora kinase B
Type:Protein
Mol. Mass.:39327.72
Organism:Homo sapiens (Human)
Description:Q96GD4
Residue:344
BDBM50418251
NameBDBM50418251
Synonyms:CHEMBL1614776
TypeSmall organic molecule
Emp. Form.C22H30N8O2
Mol. Mass.438.526
SMILESC[C@H]1CC[C@H](CN1c1cc(nc(N)n1)-c1ccc2c(N)[nH]nc2c1)NC(=O)OC(C)(C)C