Reaction Details
Target3-phosphoinositide-dependent protein kinase 1
LigandBDBM50341241
Substrate/Competitorn/a
Meas. Tech.ChEMBL_742329 (CHEMBL1768778)
IC50 1.6±n/a nM
Citation Medina, JRBecker, CJBlackledge, CWDuquenne, CFeng, YGrant, SWHeerding, DLi, WHMiller, WHRomeril, SPScherzer, DShu, ABobko, MAChadderton, ARDumble, MGardiner, CMGilbert, SLiu, QRabindran, SKSudakin, VXiang, HBrady, PGCampobasso, NWard, PAxten, JM Structure-based design of potent and selective 3-phosphoinositide-dependent kinase-1 (PDK1) inhibitors. J Med Chem54:1871-95 (2011) 
 
3-phosphoinositide-dependent protein kinase 1
Name:3-phosphoinositide-dependent protein kinase 1
Type:Enzyme
Mol. Mass.:63157.65
Organism:Homo sapiens (Human)
Description:O15530
Residue:556
BDBM50341241
NameBDBM50341241
Synonyms:(3S,6R)-1-[6-(3-Amino-1H-indazol-6-yl)-2-(methylamino)-4-pyrimidinyl]-6-methyl-N-phenyl-3-piperidinecarboxamide | CHEMBL1765738
TypeSmall organic molecule
Emp. Form.C25H28N8O
Mol. Mass.456.5428
SMILESCNc1nc(cc(n1)-c1ccc2c(N)n[nH]c2c1)N1C[C@H](CC[C@H]1C)C(=O)Nc1ccccc1