Reaction Details
TargetAurora kinase A
LigandBDBM50341249
Substrate/Competitorn/a
Meas. Tech.ChEMBL_742330 (CHEMBL1768779)
IC50 126±n/a nM
Citation Medina, JRBecker, CJBlackledge, CWDuquenne, CFeng, YGrant, SWHeerding, DLi, WHMiller, WHRomeril, SPScherzer, DShu, ABobko, MAChadderton, ARDumble, MGardiner, CMGilbert, SLiu, QRabindran, SKSudakin, VXiang, HBrady, PGCampobasso, NWard, PAxten, JM Structure-based design of potent and selective 3-phosphoinositide-dependent kinase-1 (PDK1) inhibitors. J Med Chem54:1871-95 (2011) 
 
Aurora kinase A
Name:Aurora kinase A
Type:Serine/threonine-protein kinase
Mol. Mass.:45830.98
Organism:Homo sapiens (Human)
Description:O14965
Residue:403
BDBM50341249
NameBDBM50341249
Synonyms:1,1-Dimethylethyl{(3R,5R)-1-[2-Amino-6-(3-amino-1H-indazol-6-yl)-4-pyrimidinyl]-5-methyl-3-piperidinyl}methylcarbamate | CHEMBL1765750
TypeSmall organic molecule
Emp. Form.C24H34N8O2
Mol. Mass.466.5792
SMILESCNc1nc(cc(n1)-c1ccc2c(N)n[nH]c2c1)N1C[C@H](C)C[C@H](C1)N(C)C(=O)OC(C)(C)C