Reaction Details
TargetAurora kinase A
LigandBDBM50418255
Substrate/Competitorn/a
Meas. Tech.ChEMBL_742330 (CHEMBL1768779)
IC50 3162±n/a nM
Citation Medina, JRBecker, CJBlackledge, CWDuquenne, CFeng, YGrant, SWHeerding, DLi, WHMiller, WHRomeril, SPScherzer, DShu, ABobko, MAChadderton, ARDumble, MGardiner, CMGilbert, SLiu, QRabindran, SKSudakin, VXiang, HBrady, PGCampobasso, NWard, PAxten, JM Structure-based design of potent and selective 3-phosphoinositide-dependent kinase-1 (PDK1) inhibitors. J Med Chem54:1871-95 (2011) 
 
Aurora kinase A
Name:Aurora kinase A
Type:Serine/threonine-protein kinase
Mol. Mass.:45830.98
Organism:Homo sapiens (Human)
Description:O14965
Residue:403
BDBM50418255
NameBDBM50418255
Synonyms:CHEMBL1765760
TypeSmall organic molecule
Emp. Form.C12H13N7
Mol. Mass.255.2785
SMILESCNc1cc(nc(N)n1)-c1ccc2c(N)n[nH]c2c1