Reaction Details
TargetAurora kinase B
LigandBDBM50418255
Substrate/Competitorn/a
Meas. Tech.ChEMBL_742331 (CHEMBL1768780)
IC50 12589±n/a nM
Citation Medina, JRBecker, CJBlackledge, CWDuquenne, CFeng, YGrant, SWHeerding, DLi, WHMiller, WHRomeril, SPScherzer, DShu, ABobko, MAChadderton, ARDumble, MGardiner, CMGilbert, SLiu, QRabindran, SKSudakin, VXiang, HBrady, PGCampobasso, NWard, PAxten, JM Structure-based design of potent and selective 3-phosphoinositide-dependent kinase-1 (PDK1) inhibitors. J Med Chem54:1871-95 (2011) 
 
Aurora kinase B
Name:Aurora kinase B
Type:Protein
Mol. Mass.:39327.72
Organism:Homo sapiens (Human)
Description:Q96GD4
Residue:344
BDBM50418255
NameBDBM50418255
Synonyms:CHEMBL1765760
TypeSmall organic molecule
Emp. Form.C12H13N7
Mol. Mass.255.2785
SMILESCNc1cc(nc(N)n1)-c1ccc2c(N)n[nH]c2c1