Reaction Details
Target3-phosphoinositide-dependent protein kinase 1
LigandBDBM50418257
Substrate/Competitorn/a
Meas. Tech.ChEMBL_742334 (CHEMBL1768783)
IC50 126±n/a nM
Citation Medina, JRBecker, CJBlackledge, CWDuquenne, CFeng, YGrant, SWHeerding, DLi, WHMiller, WHRomeril, SPScherzer, DShu, ABobko, MAChadderton, ARDumble, MGardiner, CMGilbert, SLiu, QRabindran, SKSudakin, VXiang, HBrady, PGCampobasso, NWard, PAxten, JM Structure-based design of potent and selective 3-phosphoinositide-dependent kinase-1 (PDK1) inhibitors. J Med Chem54:1871-95 (2011) 
 
3-phosphoinositide-dependent protein kinase 1
Name:3-phosphoinositide-dependent protein kinase 1
Type:Enzyme
Mol. Mass.:63157.65
Organism:Homo sapiens (Human)
Description:O15530
Residue:556
BDBM50418257
NameBDBM50418257
Synonyms:CHEMBL1765730
TypeSmall organic molecule
Emp. Form.C17H21N7
Mol. Mass.323.3955
SMILESC[C@@H]1CCCCN1c1cc(nc(N)n1)-c1ccc2c(N)n[nH]c2c1