Reaction Details
Target3-phosphoinositide-dependent protein kinase 1
LigandBDBM50418244
Substrate/Competitorn/a
Meas. Tech.ChEMBL_742334 (CHEMBL1768783)
IC50 126±n/a nM
Citation Medina, JRBecker, CJBlackledge, CWDuquenne, CFeng, YGrant, SWHeerding, DLi, WHMiller, WHRomeril, SPScherzer, DShu, ABobko, MAChadderton, ARDumble, MGardiner, CMGilbert, SLiu, QRabindran, SKSudakin, VXiang, HBrady, PGCampobasso, NWard, PAxten, JM Structure-based design of potent and selective 3-phosphoinositide-dependent kinase-1 (PDK1) inhibitors. J Med Chem54:1871-95 (2011) 
 
3-phosphoinositide-dependent protein kinase 1
Name:3-phosphoinositide-dependent protein kinase 1
Type:Enzyme
Mol. Mass.:63157.65
Organism:Homo sapiens (Human)
Description:O15530
Residue:556
BDBM50418244
NameBDBM50418244
Synonyms:CHEMBL1765733 | D3RKN_92
TypeSmall organic molecule
Emp. Form.C23H24N8O
Mol. Mass.428.4897
SMILESNc1n[nH]c2cc(ccc12)-c1cc(nc(N)n1)N1CCC[C@H](C1)C(=O)Nc1ccccc1