Reaction Details
TargetGlucose-dependent insulinotropic receptor
LigandBDBM50341313
Substrate/Competitorn/a
Meas. Tech.ChEMBL_742671 (CHEMBL1769549)
Ki 2270±n/a nM
Citation McClure, KFDarout, EGuimarães, CRDeNinno, MPMascitti, VMunchhof, MJRobinson, RPKohrt, JHarris, ARMoore, DELi, BSamp, LLefker, BAFutatsugi, KKung, DBonin, PDCornelius, PWang, RSalter, EHornby, SKalgutkar, ASChen, Y Activation of the G-protein-coupled receptor 119: a conformation-based hypothesis for understanding agonist response. J Med Chem54:1948-52 (2011) 
 
Glucose-dependent insulinotropic receptor
Name:Glucose-dependent insulinotropic receptor
Type:Protein
Mol. Mass.:36901.49
Organism:Homo sapiens (Human)
Description:Q8TDV5
Residue:335
BDBM50341313
NameBDBM50341313
Synonyms:(1S,5S,8S)-Isopropyl 8-(5-Methyl-6-(2-methylpyridin-3-yloxy)pyrimidin-4-yloxy)-6-oxa-3-azabicyclo[3.2.1]-octane-3-carboxylate | CHEMBL1766203
TypeSmall organic molecule
Emp. Form.C21H26N4O5
Mol. Mass.414.4549
SMILESCC(C)OC(=O)N1C[C@H]2CO[C@@H](C1)[C@H]2Oc1ncnc(Oc2cccnc2C)c1C