Reaction Details
TargetGlucose-dependent insulinotropic receptor
LigandBDBM50341309
Substrate/Competitorn/a
Meas. Tech.ChEMBL_742672 (CHEMBL1769550)
Ki 140±n/a nM
Citation McClure, KFDarout, EGuimarães, CRDeNinno, MPMascitti, VMunchhof, MJRobinson, RPKohrt, JHarris, ARMoore, DELi, BSamp, LLefker, BAFutatsugi, KKung, DBonin, PDCornelius, PWang, RSalter, EHornby, SKalgutkar, ASChen, Y Activation of the G-protein-coupled receptor 119: a conformation-based hypothesis for understanding agonist response. J Med Chem54:1948-52 (2011) 
 
Glucose-dependent insulinotropic receptor
Name:Glucose-dependent insulinotropic receptor
Type:PROTEIN
Mol. Mass.:51687.59
Organism:Rattus norvegicus
Description:ChEMBL_1506411
Residue:468
BDBM50341309
NameBDBM50341309
Synonyms:CHEMBL1766081 | isopropyl 4-(5-methyl-6-(2-methylpyridin-3-yloxy)pyrimidin-4-yloxy)piperidine-1-carboxylate
TypeSmall organic molecule
Emp. Form.C20H26N4O4
Mol. Mass.386.4448
SMILESCC(C)OC(=O)N1CCC(CC1)Oc1ncnc(Oc2cccnc2C)c1C