Reaction Details
TargetMitogen-activated protein kinase 14
LigandBDBM50341343
Substrate/Competitorn/a
Meas. Tech.ChEMBL_742454 (CHEMBL1769102)
IC50 158±n/a nM
Citation Goldstein, DMSoth, MGabriel, TDewdney, NKuglstatter, AArzeno, HChen, JBingenheimer, WDalrymple, SADunn, JFarrell, RFrauchiger, SLa Fargue, JGhate, MGraves, BHill, RJLi, FLitman, RLoe, BMcIntosh, JMcWeeney, DPapp, EPark, JReese, HFRoberts, RTRotstein, DSan Pablo, BSarma, KStahl, MSung, MLSuttman, RTSjogren, EBTan, YTrejo, AWelch, MWeller, PWong, BRZecic, H Discovery of 6-(2,4-difluorophenoxy)-2-[3-hydroxy-1-(2-hydroxyethyl)propylamino]-8-methyl-8H-pyrido[2,3-d]pyrimidin-7-one (pamapimod) and 6-(2,4-difluorophenoxy)-8-methyl-2-(tetrahydro-2H-pyran-4-ylamino)pyrido[2,3-d]pyrimidin-7(8H)-one (R1487) as orally bioavailable and highly selective inhibitors J Med Chem54:2255-65 (2011) 
 
Mitogen-activated protein kinase 14
Name:Mitogen-activated protein kinase 14
Type:Serine/threonine-protein kinase
Mol. Mass.:41286.76
Organism:Homo sapiens (Human)
Description:Q16539
Residue:360
BDBM50341343
NameBDBM50341343
Synonyms:6-(2,4-Difluorophenoxy)-2-(2-hydroxy-1-hydroxymethyl-ethylamino)-8-methyl-8H-pyrido[2,3-d]pyrimidin-7-one | CHEMBL1766577
TypeSmall organic molecule
Emp. Form.C17H16F2N4O4
Mol. Mass.378.3301
SMILESCn1c2nc(NC(CO)CO)ncc2cc(Oc2ccc(F)cc2F)c1=O