Reaction Details
TargetMitogen-activated protein kinase 14
LigandBDBM50341376
Substrate/Competitorn/a
Meas. Tech.ChEMBL_742456 (CHEMBL1769104)
Kd 10±n/a nM
Citation Goldstein, DMSoth, MGabriel, TDewdney, NKuglstatter, AArzeno, HChen, JBingenheimer, WDalrymple, SADunn, JFarrell, RFrauchiger, SLa Fargue, JGhate, MGraves, BHill, RJLi, FLitman, RLoe, BMcIntosh, JMcWeeney, DPapp, EPark, JReese, HFRoberts, RTRotstein, DSan Pablo, BSarma, KStahl, MSung, MLSuttman, RTSjogren, EBTan, YTrejo, AWelch, MWeller, PWong, BRZecic, H Discovery of 6-(2,4-difluorophenoxy)-2-[3-hydroxy-1-(2-hydroxyethyl)propylamino]-8-methyl-8H-pyrido[2,3-d]pyrimidin-7-one (pamapimod) and 6-(2,4-difluorophenoxy)-8-methyl-2-(tetrahydro-2H-pyran-4-ylamino)pyrido[2,3-d]pyrimidin-7(8H)-one (R1487) as orally bioavailable and highly selective inhibitors J Med Chem54:2255-65 (2011) 
 
Mitogen-activated protein kinase 14
Name:Mitogen-activated protein kinase 14
Type:Serine/threonine-protein kinase
Mol. Mass.:41286.76
Organism:Homo sapiens (Human)
Description:Q16539
Residue:360
BDBM50341376
NameBDBM50341376
Synonyms:3-(2,6-dichlorophenyl)-7-(4-(2-(diethylamino)ethoxy)phenylamino)-1-methyl-3,4-dihydropyrimido[4,5-d]pyrimidin-2(1H)-one CHEMBL1234002
TypeSmall organic molecule
Emp. Form.C25H28Cl2N6O2
Mol. Mass.515.435
SMILESCCN(CC)CCOc1ccc(Nc2ncc3CN(C(=O)N(C)c3n2)c2c(Cl)cccc2Cl)cc1