Reaction Details
TargetHistamine H1 receptor
LigandBDBM50418277
Substrate/Competitorn/a
Meas. Tech.ChEMBL_741663 (CHEMBL1769655)
Ki 63.1±n/a nM
Citation Procopiou, PABrowning, CBuckley, JMClark, KLFechner, LGore, PMHancock, APHodgson, STHolmes, DSKranz, MLooker, BEMorriss, KMParton, DLRussell, LJSlack, RJSollis, SLVile, SWatts, CJ The discovery of phthalazinone-based human H1 and H3 single-ligand antagonists suitable for intranasal administration for the treatment of allergic rhinitis. J Med Chem54:2183-95 (2011) 
 
Histamine H1 receptor
Name:Histamine H1 receptor
Type:G Protein-Coupled Receptor (GPCR)
Mol. Mass.:55808.72
Organism:Homo sapiens (Human)
Description:Cell pellets from SK-N-MC cells transfected with human H1 receptor were used in binding assay.
Residue:487
BDBM50418277
NameBDBM50418277
Synonyms:CHEMBL1767157
TypeSmall organic molecule
Emp. Form.C22H24ClN3O
Mol. Mass.381.898
SMILESCN1CCCC1CCn1nc(Cc2ccc(Cl)cc2)c2ccccc2c1=O