Reaction Details
TargetHistamine H1 receptor
LigandBDBM50418290
Substrate/Competitorn/a
Meas. Tech.ChEMBL_741663 (CHEMBL1769655)
Ki 2±n/a nM
Citation Procopiou, PABrowning, CBuckley, JMClark, KLFechner, LGore, PMHancock, APHodgson, STHolmes, DSKranz, MLooker, BEMorriss, KMParton, DLRussell, LJSlack, RJSollis, SLVile, SWatts, CJ The discovery of phthalazinone-based human H1 and H3 single-ligand antagonists suitable for intranasal administration for the treatment of allergic rhinitis. J Med Chem54:2183-95 (2011) 
 
Histamine H1 receptor
Name:Histamine H1 receptor
Type:G Protein-Coupled Receptor (GPCR)
Mol. Mass.:55808.72
Organism:Homo sapiens (Human)
Description:Cell pellets from SK-N-MC cells transfected with human H1 receptor were used in binding assay.
Residue:487
BDBM50418290
NameBDBM50418290
Synonyms:CHEMBL1767147
TypeSmall organic molecule
Emp. Form.C22H25N3O2
Mol. Mass.363.4528
SMILESCOc1cccc(Cc2nn(C[C@H]3CCCN3C)c(=O)c3ccccc23)c1