Reaction Details
TargetCytochrome P450 2C9
LigandBDBM50090677
Substrate/Competitorn/a
Meas. Tech.ChEMBL_742212 (CHEMBL1768382)
IC50 318±n/a nM
Citation Lucas, SNegri, MHeim, RZimmer, CHartmann, RW Fine-tuning the selectivity of aldosterone synthase inhibitors: structure-activity and structure-selectivity insights from studies of heteroaryl substituted 1,2,5,6-tetrahydropyrrolo[3,2,1-ij]quinolin-4-one derivatives. J Med Chem54:2307-19 (2011) 
 
Cytochrome P450 2C9
Name:Cytochrome P450 2C9
Type:Enzyme
Mol. Mass.:55636.33
Organism:Homo sapiens (Human)
Description:P11712
Residue:490
BDBM50090677
NameBDBM50090677
Synonyms:4-Amino-N-(2-phenyl-2H-pyrazol-3-yl)-benzenesulfonamide CHEMBL1109 Sulfabid US9180183, Sulfaphenazole
TypeSmall organic molecule
Emp. Form.C15H14N4O2S
Mol. Mass.314.362
SMILESNc1ccc(cc1)S(=O)(=O)Nc1ccnn1-c1ccccc1