Reaction Details
TargetDual specificity mitogen-activated protein kinase kinase 6
LigandBDBM50341519
Substrate/Competitorn/a
Meas. Tech.ChEMBL_742139 (CHEMBL1769199)
Ki>1000±n/a nM
Citation Charrier, JDMiller, AKay, DPBrenchley, GTwin, HCCollier, PNRamaya, SKeily, SBDurrant, SJKnegtel, RMTanner, AJBrown, KCurnock, APJimenez, JM Discovery and structure-activity relationship of 3-aminopyrid-2-ones as potent and selective interleukin-2 inducible T-cell kinase (Itk) inhibitors. J Med Chem54:2341-50 (2011) 
 
Dual specificity mitogen-activated protein kinase kinase 6
Name:Dual specificity mitogen-activated protein kinase kinase 6
Type:Protein
Mol. Mass.:37494.96
Organism:Homo sapiens (Human)
Description:P52564
Residue:334
BDBM50341519
NameBDBM50341519
Synonyms:(S)-3-(4-(2-(pyrrolidin-1-ylmethyl)pyrrolidin-1-yl)benzoylamino)-5-(6-(methylamino)pyrazin-2-yl)-(1H)-pyridin-2-one | CHEMBL1765781
TypeSmall organic molecule
Emp. Form.C26H31N7O2
Mol. Mass.473.57
SMILESCNc1cncc(n1)-c1c[nH]c(=O)c(NC(=O)c2ccc(cc2)N2CCC[C@H]2CN2CCCC2)c1