Reaction Details
TargetReceptor-type tyrosine-protein kinase FLT3
LigandBDBM50341531
Substrate/Competitorn/a
Meas. Tech.ChEMBL_742046 (CHEMBL1768909)
Ki 120±n/a nM
Citation Charrier, JDMiller, AKay, DPBrenchley, GTwin, HCCollier, PNRamaya, SKeily, SBDurrant, SJKnegtel, RMTanner, AJBrown, KCurnock, APJimenez, JM Discovery and structure-activity relationship of 3-aminopyrid-2-ones as potent and selective interleukin-2 inducible T-cell kinase (Itk) inhibitors. J Med Chem54:2341-50 (2011) 
 
Receptor-type tyrosine-protein kinase FLT3
Name:Receptor-type tyrosine-protein kinase FLT3
Type:Enzyme
Mol. Mass.:112888.62
Organism:Homo sapiens (Human)
Description:P36888
Residue:993
BDBM50341531
NameBDBM50341531
Synonyms:3-(4-(Piperidin-1-yl)benzoylamino)-5-(6-(cyclopropylamino)pyridin-2-yl)-(1H)-pyridin-2-one | CHEMBL1765778
TypeSmall organic molecule
Emp. Form.C25H27N5O2
Mol. Mass.429.5142
SMILESO=C(Nc1cc(c[nH]c1=O)-c1cccc(NC2CC2)n1)c1ccc(cc1)N1CCCCC1