Reaction Details
TargetReceptor-type tyrosine-protein kinase FLT3
LigandBDBM50341529
Substrate/Competitorn/a
Meas. Tech.ChEMBL_742046 (CHEMBL1768909)
Ki 410±n/a nM
Citation Charrier, JDMiller, AKay, DPBrenchley, GTwin, HCCollier, PNRamaya, SKeily, SBDurrant, SJKnegtel, RMTanner, AJBrown, KCurnock, APJimenez, JM Discovery and structure-activity relationship of 3-aminopyrid-2-ones as potent and selective interleukin-2 inducible T-cell kinase (Itk) inhibitors. J Med Chem54:2341-50 (2011) 
 
Receptor-type tyrosine-protein kinase FLT3
Name:Receptor-type tyrosine-protein kinase FLT3
Type:Enzyme
Mol. Mass.:112888.62
Organism:Homo sapiens (Human)
Description:P36888
Residue:993
BDBM50341529
NameBDBM50341529
Synonyms:(S)-3-(4-(2-(pyrrolidin-1-ylmethyl)pyrrolidin-1-yl)benzoylamino)-5-(3-cyano-5-(methylamino)phenyl)-(1H)-pyridin-2-one | CHEMBL1765784
TypeSmall organic molecule
Emp. Form.C29H32N6O2
Mol. Mass.496.6034
SMILESCNc1cc(cc(c1)-c1c[nH]c(=O)c(NC(=O)c2ccc(cc2)N2CCC[C@H]2CN2CCCC2)c1)C#N