Reaction Details
TargetProto-oncogene tyrosine-protein kinase Src
LigandBDBM50341523
Substrate/Competitorn/a
Meas. Tech.ChEMBL_742159 (CHEMBL1769219)
Ki 220±n/a nM
Citation Charrier, JDMiller, AKay, DPBrenchley, GTwin, HCCollier, PNRamaya, SKeily, SBDurrant, SJKnegtel, RMTanner, AJBrown, KCurnock, APJimenez, JM Discovery and structure-activity relationship of 3-aminopyrid-2-ones as potent and selective interleukin-2 inducible T-cell kinase (Itk) inhibitors. J Med Chem54:2341-50 (2011) 
 
Proto-oncogene tyrosine-protein kinase Src
Name:Proto-oncogene tyrosine-protein kinase Src
Type:Protein
Mol. Mass.:59838.60
Organism:Homo sapiens (Human)
Description:P12931
Residue:536
BDBM50341523
NameBDBM50341523
Synonyms:3-(4-(Piperidin-1-yl)benzoylamino)-5-(3-(methylamino)phenyl)-(1H)-pyridin-2-one | CHEMBL1765776
TypeSmall organic molecule
Emp. Form.C24H26N4O2
Mol. Mass.402.4888
SMILESCNc1cccc(c1)-c1c[nH]c(=O)c(NC(=O)c2ccc(cc2)N2CCCCC2)c1