Reaction Details
TargetProto-oncogene tyrosine-protein kinase Src
LigandBDBM50341524
Substrate/Competitorn/a
Meas. Tech.ChEMBL_742159 (CHEMBL1769219)
Ki 480±n/a nM
Citation Charrier, JDMiller, AKay, DPBrenchley, GTwin, HCCollier, PNRamaya, SKeily, SBDurrant, SJKnegtel, RMTanner, AJBrown, KCurnock, APJimenez, JM Discovery and structure-activity relationship of 3-aminopyrid-2-ones as potent and selective interleukin-2 inducible T-cell kinase (Itk) inhibitors. J Med Chem54:2341-50 (2011) 
 
Proto-oncogene tyrosine-protein kinase Src
Name:Proto-oncogene tyrosine-protein kinase Src
Type:Protein
Mol. Mass.:59838.60
Organism:Homo sapiens (Human)
Description:P12931
Residue:536
BDBM50341524
NameBDBM50341524
Synonyms:3-(4-(Piperidin-1-yl)benzoylamino)-5-(6-(methylamino)pyridin-2-yl)-(1H)-pyridin-2-one | CHEMBL1765777
TypeSmall organic molecule
Emp. Form.C23H25N5O2
Mol. Mass.403.4769
SMILESCNc1cccc(n1)-c1c[nH]c(=O)c(NC(=O)c2ccc(cc2)N2CCCCC2)c1