Reaction Details
TargetProto-oncogene tyrosine-protein kinase Src
LigandBDBM50341528
Substrate/Competitorn/a
Meas. Tech.ChEMBL_742159 (CHEMBL1769219)
Ki 300±n/a nM
Citation Charrier, JDMiller, AKay, DPBrenchley, GTwin, HCCollier, PNRamaya, SKeily, SBDurrant, SJKnegtel, RMTanner, AJBrown, KCurnock, APJimenez, JM Discovery and structure-activity relationship of 3-aminopyrid-2-ones as potent and selective interleukin-2 inducible T-cell kinase (Itk) inhibitors. J Med Chem54:2341-50 (2011) 
 
Proto-oncogene tyrosine-protein kinase Src
Name:Proto-oncogene tyrosine-protein kinase Src
Type:Protein
Mol. Mass.:59838.60
Organism:Homo sapiens (Human)
Description:P12931
Residue:536
BDBM50341528
NameBDBM50341528
Synonyms:(S)-3-(4-(2-(pyrrolidin-1-ylmethyl)pyrrolidin-1-yl)benzoylamino)-5-(3-fluoro-5-(methylamino)phenyl)-(1H)-pyridin-2-one | CHEMBL1765783
TypeSmall organic molecule
Emp. Form.C28H32FN5O2
Mol. Mass.489.5844
SMILESCNc1cc(F)cc(c1)-c1c[nH]c(=O)c(NC(=O)c2ccc(cc2)N2CCC[C@H]2CN2CCCC2)c1