Reaction Details
TargetTyrosine-protein kinase ITK/TSK
LigandBDBM50341538
Substrate/Competitorn/a
Meas. Tech.ChEMBL_741887 (CHEMBL1768448)
Ki 530±n/a nM
Citation Charrier, JDMiller, AKay, DPBrenchley, GTwin, HCCollier, PNRamaya, SKeily, SBDurrant, SJKnegtel, RMTanner, AJBrown, KCurnock, APJimenez, JM Discovery and structure-activity relationship of 3-aminopyrid-2-ones as potent and selective interleukin-2 inducible T-cell kinase (Itk) inhibitors. J Med Chem54:2341-50 (2011) 
 
Tyrosine-protein kinase ITK/TSK
Name:Tyrosine-protein kinase ITK/TSK
Type:Protein
Mol. Mass.:71839.20
Organism:Homo sapiens (Human)
Description:Q08881
Residue:620
BDBM50341538
NameBDBM50341538
Synonyms:3-(4-Ethylbenzoylamino)-5-(pyridin-4-yl)-(1H)-pyridin-2-one | CHEMBL1765768
TypeSmall organic molecule
Emp. Form.C19H17N3O2
Mol. Mass.319.3572
SMILESCCc1ccc(cc1)C(=O)Nc1cc(c[nH]c1=O)-c1ccncc1