Reaction Details
TargetTyrosine-protein kinase ITK/TSK
LigandBDBM50341527
Substrate/Competitorn/a
Meas. Tech.ChEMBL_741887 (CHEMBL1768448)
Ki 20±n/a nM
Citation Charrier, JDMiller, AKay, DPBrenchley, GTwin, HCCollier, PNRamaya, SKeily, SBDurrant, SJKnegtel, RMTanner, AJBrown, KCurnock, APJimenez, JM Discovery and structure-activity relationship of 3-aminopyrid-2-ones as potent and selective interleukin-2 inducible T-cell kinase (Itk) inhibitors. J Med Chem54:2341-50 (2011) 
 
Tyrosine-protein kinase ITK/TSK
Name:Tyrosine-protein kinase ITK/TSK
Type:Protein
Mol. Mass.:71839.20
Organism:Homo sapiens (Human)
Description:Q08881
Residue:620
BDBM50341527
NameBDBM50341527
Synonyms:(S)-3-(4-(2-(pyrrolidin-1-ylmethyl)pyrrolidin-1-yl)benzoylamino)-5-(5-(methylamino)pyridin-3-yl)-(1H)-pyridin-2-one | CHEMBL1765782
TypeSmall organic molecule
Emp. Form.C27H32N6O2
Mol. Mass.472.582
SMILESCNc1cncc(c1)-c1c[nH]c(=O)c(NC(=O)c2ccc(cc2)N2CCC[C@H]2CN2CCCC2)c1