Reaction Details
TargetNuclear receptor subfamily 5 group A member 2
LigandBDBM50418317
Substrate/Competitorn/a
Meas. Tech.ChEMBL_743679 (CHEMBL1767448)
EC50 1258.93±n/a nM
Citation Whitby, RJStec, JBlind, RDDixon, SLeesnitzer, LMOrband-Miller, LAWilliams, SPWillson, TMXu, RZuercher, WJCai, FIngraham, HA Small molecule agonists of the orphan nuclear receptors steroidogenic factor-1 (SF-1, NR5A1) and liver receptor homologue-1 (LRH-1, NR5A2). J Med Chem54:2266-81 (2011) 
 
Nuclear receptor subfamily 5 group A member 2
Name:Nuclear receptor subfamily 5 group A member 2
Type:Nuclear Hormone Receptor
Mol. Mass.:61341.37
Organism:Homo sapiens (Human)
Description:n/a
Residue:541
BDBM50418317
NameBDBM50418317
Synonyms:CHEMBL1765950
TypeSmall organic molecule
Emp. Form.C28H40
Mol. Mass.376.6172
SMILESCCCCCCC1=C(C2CCCCC2)[C@@]2(CCC[C@@H]2C1)C(=C)c1ccccc1