Reaction Details
TargetSomatostatin receptor type 2
LigandBDBM50341562
Substrate/Competitorn/a
Meas. Tech.ChEMBL_743882 (CHEMBL1767825)
Ki 0.062±n/a nM
Citation Wolkenberg, SEZhao, ZThut, CMaxwell, JWMcDonald, TPKinose, FReilly, MLindsley, CWHartman, GD Design, synthesis, and evaluation of novel 3,6-diaryl-4-aminoalkoxyquinolines as selective agonists of somatostatin receptor subtype 2. J Med Chem54:2351-8 (2011) 
 
Somatostatin receptor type 2
Name:Somatostatin receptor type 2
Type:Enzyme
Mol. Mass.:41344.94
Organism:Homo sapiens (Human)
Description:P30874
Residue:369
BDBM50341562
NameBDBM50341562
Synonyms:7-chloro-6-(4-chlorophenyl)-3-(3,5-dimethylphenyl)-4-(2-(piperidin-2-yl)ethoxy)-1,2-dihydroquinoline | CHEMBL1766109
TypeSmall organic molecule
Emp. Form.C30H32Cl2N2O
Mol. Mass.507.494
SMILESCc1cc(C)cc(c1)C1=C(OCCC2CCCCN2)c2cc(c(Cl)cc2NC1)-c1ccc(Cl)cc1