Reaction Details
TargetSomatostatin receptor type 2
LigandBDBM50341574
Substrate/Competitorn/a
Meas. Tech.ChEMBL_743881 (CHEMBL1767824)
IC50 0.39±n/a nM
Citation Wolkenberg, SEZhao, ZThut, CMaxwell, JWMcDonald, TPKinose, FReilly, MLindsley, CWHartman, GD Design, synthesis, and evaluation of novel 3,6-diaryl-4-aminoalkoxyquinolines as selective agonists of somatostatin receptor subtype 2. J Med Chem54:2351-8 (2011) 
 
Somatostatin receptor type 2
Name:Somatostatin receptor type 2
Type:Enzyme
Mol. Mass.:41344.94
Organism:Homo sapiens (Human)
Description:P30874
Residue:369
BDBM50341574
NameBDBM50341574
Synonyms:3-{7-Chloro-3-(3,5-dimethylphenyl)-4-[2-(piperidin-2-yl)ethoxy]quinolin-6-yl}benzamide | CHEMBL1766099
TypeSmall organic molecule
Emp. Form.C31H32ClN3O2
Mol. Mass.514.058
SMILESCc1cc(C)cc(c1)-c1cnc2cc(Cl)c(cc2c1OCC[C@H]1CCCCN1)-c1ccc(cc1)C(N)=O