Reaction Details
TargetNitric oxide synthase, endothelial
LigandBDBM50341686
Substrate/Competitorn/a
Meas. Tech.ChEMBL_743327 (CHEMBL1767574)
Ki 1520±n/a nM
Citation Xue, FFang, JDelker, SLLi, HMartásek, PRoman, LJPoulos, TLSilverman, RB Symmetric double-headed aminopyridines, a novel strategy for potent and membrane-permeable inhibitors of neuronal nitric oxide synthase. J Med Chem54:2039-48 (2011) 
 
Nitric oxide synthase, endothelial
Name:Nitric oxide synthase, endothelial
Type:Enzyme
Mol. Mass.:133292.26
Organism:Bos taurus (bovine)
Description:Recombinant eNOS overexpressed in E. coli was used in enzyme assays.
Residue:1205
BDBM50341686
NameBDBM50341686
Synonyms:6,6'-(2,2'-(Naphthalene-2,7-diyl)bis(ethane-2,1-diyl))bis(4-methylpyridin-2-amine) | CHEMBL1766629
TypeSmall organic molecule
Emp. Form.C26H28N4
Mol. Mass.396.5273
SMILESCc1cc(N)nc(CCc2ccc3ccc(CCc4cc(C)cc(N)n4)cc3c2)c1