Reaction Details
TargetNitric oxide synthase, brain
LigandBDBM50341684
Substrate/Competitorn/a
Meas. Tech.ChEMBL_743326 (CHEMBL1767573)
Ki 49±n/a nM
Citation Xue, FFang, JDelker, SLLi, HMartásek, PRoman, LJPoulos, TLSilverman, RB Symmetric double-headed aminopyridines, a novel strategy for potent and membrane-permeable inhibitors of neuronal nitric oxide synthase. J Med Chem54:2039-48 (2011) 
 
Nitric oxide synthase, brain
Name:Nitric oxide synthase, brain
Type:Enzyme
Mol. Mass.:160570.98
Organism:Rattus norvegicus (rat)
Description:Recombinant nNOS overexpressed in E. coli was used in enzyme assays.
Residue:1429
BDBM50341684
NameBDBM50341684
Synonyms:6,6'-(2,2'-(1,3-Phenylene)bis(ethane-2,1-diyl))bis(4-methylpyridin-2-amine) NOS Inhibitor, 3h US9951014, Name 31a
TypeSmall organic molecule
Emp. Form.C22H26N4
Mol. Mass.346.4686
SMILESCc1cc(N)nc(CCc2cccc(CCc3cc(C)cc(N)n3)c2)c1