Reaction Details
TargetSerine/threonine-protein kinase ATR
LigandBDBM50341723
Substrate/Competitorn/a
Meas. Tech.ChEMBL_743338 (CHEMBL1767585)
IC50 740±n/a nM
Citation Charrier, JDDurrant, SJGolec, JMKay, DPKnegtel, RMMacCormick, SMortimore, MO'Donnell, MEPinder, JLReaper, PMRutherford, APWang, PSYoung, SCPollard, JR Discovery of potent and selective inhibitors of ataxia telangiectasia mutated and Rad3 related (ATR) protein kinase as potential anticancer agents. J Med Chem54:2320-30 (2011) 
 
Serine/threonine-protein kinase ATR
Name:Serine/threonine-protein kinase ATR
Type:Protein
Mol. Mass.:301404.58
Organism:Homo sapiens (Human)
Description:Q13535
Residue:2644
BDBM50341723
NameBDBM50341723
Synonyms:3-amino-6-(2-methoxyphenyl)-N-phenylpyrazine-2-carboxamide | CHEMBL1766769
TypeSmall organic molecule
Emp. Form.C18H16N4O2
Mol. Mass.320.3452
SMILESCOc1ccccc1-c1cnc(N)c(n1)C(=O)Nc1ccccc1