Reaction Details
TargetSerine/threonine-protein kinase ATR
LigandBDBM50341734
Substrate/Competitorn/a
Meas. Tech.ChEMBL_743338 (CHEMBL1767585)
IC50 320±n/a nM
Citation Charrier, JDDurrant, SJGolec, JMKay, DPKnegtel, RMMacCormick, SMortimore, MO'Donnell, MEPinder, JLReaper, PMRutherford, APWang, PSYoung, SCPollard, JR Discovery of potent and selective inhibitors of ataxia telangiectasia mutated and Rad3 related (ATR) protein kinase as potential anticancer agents. J Med Chem54:2320-30 (2011) 
 
Serine/threonine-protein kinase ATR
Name:Serine/threonine-protein kinase ATR
Type:Protein
Mol. Mass.:301404.58
Organism:Homo sapiens (Human)
Description:Q13535
Residue:2644
BDBM50341734
NameBDBM50341734
Synonyms:3-amino-6-(4-hydroxyphenyl)-N-phenylpyrazine-2-carboxamide | CHEMBL1766780
TypeSmall organic molecule
Emp. Form.C17H14N4O2
Mol. Mass.306.3187
SMILESNc1ncc(nc1C(=O)Nc1ccccc1)-c1ccc(O)cc1