Reaction Details
TargetSerine-protein kinase ATM
LigandBDBM50341752
Substrate/Competitorn/a
Meas. Tech.ChEMBL_743383 (CHEMBL1767682)
IC50>8000±n/a nM
Citation Charrier, JDDurrant, SJGolec, JMKay, DPKnegtel, RMMacCormick, SMortimore, MO'Donnell, MEPinder, JLReaper, PMRutherford, APWang, PSYoung, SCPollard, JR Discovery of potent and selective inhibitors of ataxia telangiectasia mutated and Rad3 related (ATR) protein kinase as potential anticancer agents. J Med Chem54:2320-30 (2011) 
 
Serine-protein kinase ATM
Name:Serine-protein kinase ATM
Type:Protein
Mol. Mass.:350696.72
Organism:Homo sapiens (Human)
Description:Q13315
Residue:3056
BDBM50341752
NameBDBM50341752
Synonyms:3-amino-6-(4-((4-hydroxybutan-2-yl)sulfonyl)phenyl)-N-phenylpyrazine-2-carboxamide | CHEMBL1766798
TypeSmall organic molecule
Emp. Form.C21H22N4O4S
Mol. Mass.426.489
SMILESCC(CCO)S(=O)(=O)c1ccc(cc1)-c1cnc(N)c(n1)C(=O)Nc1ccccc1