Reaction Details
TargetDiacylglycerol O-acyltransferase 1
LigandBDBM50341766
Substrate/Competitorn/a
Meas. Tech.ChEMBL_743546 (CHEMBL1767987)
IC50 16±n/a nM
Citation Qian, YWertheimer, SJAhmad, MCheung, AWFirooznia, FHamilton, MMHayden, SLi, SMarcopulos, NMcDermott, LTan, JYun, WGuo, LPamidimukkala, AChen, YHuang, KSRamsey, GBWhittard, TConde-Knape, KTaub, RRondinone, CMTilley, JBolin, D Discovery of orally active carboxylic acid derivatives of 2-phenyl-5-trifluoromethyloxazole-4-carboxamide as potent diacylglycerol acyltransferase-1 inhibitors for the potential treatment of obesity and diabetes. J Med Chem54:2433-46 (2011) 
 
Diacylglycerol O-acyltransferase 1
Name:Diacylglycerol O-acyltransferase 1
Type:Protein
Mol. Mass.:55297.82
Organism:Homo sapiens (Human)
Description:O75907
Residue:488
BDBM50341766
NameBDBM50341766
Synonyms:2-Phenyl-5-trifluoromethyloxazole-4-carboxylic Acid[6-(3,3-Difluoroazetidin-1-yl)pyridin-3-yl]amide | CHEMBL1766884
TypeSmall organic molecule
Emp. Form.C19H13F5N4O2
Mol. Mass.424.3241
SMILESFC(F)(F)c1oc(nc1C(=O)Nc1ccc(nc1)N1CC(F)(F)C1)-c1ccccc1