Reaction Details
TargetDiacylglycerol O-acyltransferase 1
LigandBDBM50341775
Substrate/Competitorn/a
Meas. Tech.ChEMBL_743546 (CHEMBL1767987)
IC50 136±n/a nM
Citation Qian, YWertheimer, SJAhmad, MCheung, AWFirooznia, FHamilton, MMHayden, SLi, SMarcopulos, NMcDermott, LTan, JYun, WGuo, LPamidimukkala, AChen, YHuang, KSRamsey, GBWhittard, TConde-Knape, KTaub, RRondinone, CMTilley, JBolin, D Discovery of orally active carboxylic acid derivatives of 2-phenyl-5-trifluoromethyloxazole-4-carboxamide as potent diacylglycerol acyltransferase-1 inhibitors for the potential treatment of obesity and diabetes. J Med Chem54:2433-46 (2011) 
 
Diacylglycerol O-acyltransferase 1
Name:Diacylglycerol O-acyltransferase 1
Type:Protein
Mol. Mass.:55297.82
Organism:Homo sapiens (Human)
Description:O75907
Residue:488
BDBM50341775
NameBDBM50341775
Synonyms:2-Phenyl-5-trifluoromethyloxazole-4-carboxylic Acid[4-(4-Cyclopropanecarbonylpiperazin-1-yl)phenyl]amide | CHEMBL1766892
TypeSmall organic molecule
Emp. Form.C25H23F3N4O3
Mol. Mass.484.4703
SMILESFC(F)(F)c1oc(nc1C(=O)Nc1ccc(cc1)N1CCN(CC1)C(=O)C1CC1)-c1ccccc1