Reaction Details
TargetMatrix metalloproteinase-14
LigandBDBM50341824
Substrate/Competitorn/a
Meas. Tech.ChEMBL_743597 (CHEMBL1768097)
IC50 1.2±n/a nM
Citation Shiozaki, MMaeda, KMiura, TKotoku, MYamasaki, TMatsuda, IAoki, KYasue, KImai, HUbukata, MSuma, AYokota, MHotta, TTanaka, MHase, YHaas, JFryer, AMLaird, ERLittmann, NMAndrews, SWJosey, JAMimura, TShinozaki, YYoshiuchi, HInaba, T Discovery of (1S,2R,3R)-2,3-dimethyl-2-phenyl-1-sulfamidocyclopropanecarboxylates: novel and highly selective aggrecanase inhibitors. J Med Chem54:2839-63 (2011) 
 
Matrix metalloproteinase-14
Name:Matrix metalloproteinase-14
Type:Protein
Mol. Mass.:65900.19
Organism:Homo sapiens (Human)
Description:P50281
Residue:582
BDBM50341824
NameBDBM50341824
Synonyms:(1S,2R,3R)-2-Methyl-1-[5-(4-methylpyrazol-1-yl)thiophene-2-sulfonylamino]-3-phenylcyclopropanecarboxylic Acid | CHEMBL1766900
TypeSmall organic molecule
Emp. Form.C19H19N3O4S2
Mol. Mass.417.502
SMILESC[C@@H]1[C@H](c2ccccc2)[C@]1(NS(=O)(=O)c1ccc(s1)-n1cc(C)cn1)C(O)=O