Reaction Details
TargetInterstitial collagenase
LigandBDBM50104963
Substrate/Competitorn/a
Meas. Tech.ChEMBL_743596 (CHEMBL1768096)
IC50>10000±n/a nM
Citation Shiozaki, MMaeda, KMiura, TKotoku, MYamasaki, TMatsuda, IAoki, KYasue, KImai, HUbukata, MSuma, AYokota, MHotta, TTanaka, MHase, YHaas, JFryer, AMLaird, ERLittmann, NMAndrews, SWJosey, JAMimura, TShinozaki, YYoshiuchi, HInaba, T Discovery of (1S,2R,3R)-2,3-dimethyl-2-phenyl-1-sulfamidocyclopropanecarboxylates: novel and highly selective aggrecanase inhibitors. J Med Chem54:2839-63 (2011) 
 
Interstitial collagenase
Name:Interstitial collagenase
Type:Enzyme
Mol. Mass.:54010.26
Organism:Homo sapiens (Human)
Description: P03956
Residue:469
BDBM50104963
NameBDBM50104963
Synonyms:(2S,3R)-2-(cyclopropylmethylamino)-N1-hydroxy-N4-((1S,2R)-2-hydroxy-2,3-dihydro-1H-inden-1-yl)-3-(3-hydroxybenzyl)succinamide (R)-2-(Cyclopropylmethyl-amino)-N*1*-hydroxy-3-(3-hydroxy-benzyl)-N*4*-((3S,3aR)-2-hydroxy-indan-1-yl)-succinamide CHEMBL24398
TypeSmall organic molecule
Emp. Form.C24H29N3O5
Mol. Mass.439.5042
SMILESONC(=O)[C@@H](NCC1CC1)[C@@H](Cc1cccc(O)c1)C(=O)N[C@@H]1[C@H](O)Cc2ccccc12