Reaction Details
TargetIsoform 4 of Lethal(3)malignant brain tumor-like protein 1 (4)
LigandBDBM50341828
Substrate/Competitorn/a
Meas. Tech.ChEMBL_743619 (CHEMBL1768162)
IC50 6000±n/a nM
Citation Herold, JMWigle, TJNorris, JLLam, RKorboukh, VKGao, CIngerman, LAKireev, DBSenisterra, GVedadi, MTripathy, ABrown, PJArrowsmith, CHJin, JJanzen, WPFrye, SV Small-molecule ligands of methyl-lysine binding proteins. J Med Chem54:2504-11 (2011) 
 
Isoform 4 of Lethal(3)malignant brain tumor-like protein 1 (4)
Name:Isoform 4 of Lethal(3)malignant brain tumor-like protein 1 (4)
Type:Protein
Mol. Mass.:83871.06
Organism:Homo sapiens (Human)
Description:Q9Y468-4
Residue:752
BDBM50341828
NameBDBM50341828
Synonyms:3-bromo-5-[(4-pyrrolidin-1-ylpiperidin-1-yl)carbonyl]pyridine CHEMBL1235119
TypeSmall organic molecule
Emp. Form.C15H20BrN3O
Mol. Mass.338.243
SMILESBrc1cncc(c1)C(=O)N1CCC(CC1)N1CCCC1